Discussion:
Fwd: [Flightgear-builds] Build failed in
(too old to reply)
Torsten Dreyer
2017-07-18 14:17:36 UTC
Permalink
Hi,

the windows build of fg has been flagged red for a month or so.
I thought this might have been due to some stale files of the preceeding
SimGear build but wiping the workspace of both projects (sg + fg) did not
help.

If anybody has an idea what might cause this, please...

We need a green Jenkins for the release in just a few weeks.

Torsten

---------- Forwarded message ---------
From: <***@deltasoft.com>
Date: Di., 18. Juli 2017 um 16:04 Uhr
Subject: [Flightgear-builds] Build failed in Jenkins: FlightGear-Win #2880
To: <flightgear-***@lists.sourceforge.net>


See <
http://build.flightgear.org:8080/job/FlightGear-Win/2880/display/redirect>

------------------------------------------
[...truncated 34.67 KB...]

G:\Jenkins\workspace\FlightGear-Win\install\msvc140\SimGear\include\simgear/package/Delegate.hxx(84):
note: see reference to class template instantiation
'SGSharedPtr<simgear::pkg::Install>' being compiled (compiling source file
G:\Jenkins\workspace\FlightGear-Win\source\src\GUI\PathsDialog.cxx)
G:\Jenkins\workspace\FlightGear-Win\install\msvc140\SimGear\include\simgear/structure/SGSharedPtr.hxx(90):
error C3861: 'put': identifier not found (compiling source file
G:\Jenkins\workspace\FlightGear-Win\source\src\GUI\PathsDialog.cxx)
[G:\Jenkins\workspace\FlightGear-Win\build32\src\GUI\fglauncher.vcxproj]
G:\Jenkins\workspace\FlightGear-Win\install\msvc140\SimGear\include\simgear/structure/SGSharedPtr.hxx(90):
warning C4150: deletion of pointer to incomplete type
'simgear::pkg::Install'; no destructor called (compiling source file
G:\Jenkins\workspace\FlightGear-Win\source\src\GUI\PathsDialog.cxx)
[G:\Jenkins\workspace\FlightGear-Win\build32\src\GUI\fglauncher.vcxproj]

G:\Jenkins\workspace\FlightGear-Win\install\msvc140\SimGear\include\simgear/package/Package.hxx(40):
note: see declaration of 'simgear::pkg::Install' (compiling source file
G:\Jenkins\workspace\FlightGear-Win\source\src\GUI\PathsDialog.cxx)
AircraftSearchFilterModel.cxx
G:\Jenkins\workspace\FlightGear-Win\install\msvc140\SimGear\include\simgear/structure/SGSharedPtr.hxx(90):
error C2027: use of undefined type 'simgear::pkg::Install' (compiling
source file
G:\Jenkins\workspace\FlightGear-Win\source\src\GUI\AircraftSearchFilterModel.cxx)
[G:\Jenkins\workspace\FlightGear-Win\build32\src\GUI\fglauncher.vcxproj]

G:\Jenkins\workspace\FlightGear-Win\install\msvc140\SimGear\include\simgear/package/Package.hxx(40):
note: see declaration of 'simgear::pkg::Install' (compiling source file
G:\Jenkins\workspace\FlightGear-Win\source\src\GUI\AircraftSearchFilterModel.cxx)

G:\Jenkins\workspace\FlightGear-Win\install\msvc140\SimGear\include\simgear/structure/SGSharedPtr.hxx(90):
note: while compiling class template member function 'void
SGSharedPtr<simgear::pkg::Install>::reset(void)' (compiling source file
G:\Jenkins\workspace\FlightGear-Win\source\src\GUI\AircraftSearchFilterModel.cxx)

G:\Jenkins\workspace\FlightGear-Win\install\msvc140\SimGear\include\simgear/structure/SGSharedPtr.hxx(66):
note: see reference to function template instantiation 'void
SGSharedPtr<simgear::pkg::Install>::reset(void)' being compiled (compiling
source file
G:\Jenkins\workspace\FlightGear-Win\source\src\GUI\AircraftSearchFilterModel.cxx)

G:\Jenkins\workspace\FlightGear-Win\install\msvc140\SimGear\include\simgear/package/Delegate.hxx(84):
note: see reference to class template instantiation
'SGSharedPtr<simgear::pkg::Install>' being compiled (compiling source file
G:\Jenkins\workspace\FlightGear-Win\source\src\GUI\AircraftSearchFilterModel.cxx)
G:\Jenkins\workspace\FlightGear-Win\install\msvc140\SimGear\include\simgear/structure/SGSharedPtr.hxx(90):
error C3861: 'put': identifier not found (compiling source file
G:\Jenkins\workspace\FlightGear-Win\source\src\GUI\AircraftSearchFilterModel.cxx)
[G:\Jenkins\workspace\FlightGear-Win\build32\src\GUI\fglauncher.vcxproj]
G:\Jenkins\workspace\FlightGear-Win\install\msvc140\SimGear\include\simgear/structure/SGSharedPtr.hxx(90):
warning C4150: deletion of pointer to incomplete type
'simgear::pkg::Install'; no destructor called (compiling source file
G:\Jenkins\workspace\FlightGear-Win\source\src\GUI\AircraftSearchFilterModel.cxx)
[G:\Jenkins\workspace\FlightGear-Win\build32\src\GUI\fglauncher.vcxproj]

G:\Jenkins\workspace\FlightGear-Win\install\msvc140\SimGear\include\simgear/package/Package.hxx(40):
note: see declaration of 'simgear::pkg::Install' (compiling source file
G:\Jenkins\workspace\FlightGear-Win\source\src\GUI\AircraftSearchFilterModel.cxx)
fglauncher_automoc.cpp
G:\Jenkins\workspace\FlightGear-Win\install\msvc140\SimGear\include\simgear/structure/SGSharedPtr.hxx(90):
error C2027: use of undefined type 'simgear::pkg::Install' (compiling
source file
G:\Jenkins\workspace\FlightGear-Win\build32\src\GUI\fglauncher_automoc.cpp)
[G:\Jenkins\workspace\FlightGear-Win\build32\src\GUI\fglauncher.vcxproj]

G:\Jenkins\workspace\FlightGear-Win\install\msvc140\SimGear\include\simgear/package/Package.hxx(40):
note: see declaration of 'simgear::pkg::Install' (compiling source file
G:\Jenkins\workspace\FlightGear-Win\build32\src\GUI\fglauncher_automoc.cpp)

G:\Jenkins\workspace\FlightGear-Win\install\msvc140\SimGear\include\simgear/structure/SGSharedPtr.hxx(90):
note: while compiling class template member function 'void
SGSharedPtr<simgear::pkg::Install>::reset(void)' (compiling source file
G:\Jenkins\workspace\FlightGear-Win\build32\src\GUI\fglauncher_automoc.cpp)

G:\Jenkins\workspace\FlightGear-Win\install\msvc140\SimGear\include\simgear/structure/SGSharedPtr.hxx(66):
note: see reference to function template instantiation 'void
SGSharedPtr<simgear::pkg::Install>::reset(void)' being compiled (compiling
source file
G:\Jenkins\workspace\FlightGear-Win\build32\src\GUI\fglauncher_automoc.cpp)

G:\Jenkins\workspace\FlightGear-Win\install\msvc140\SimGear\include\simgear/package/Delegate.hxx(84):
note: see reference to class template instantiation
'SGSharedPtr<simgear::pkg::Install>' being compiled (compiling source file
G:\Jenkins\workspace\FlightGear-Win\build32\src\GUI\fglauncher_automoc.cpp)
G:\Jenkins\workspace\FlightGear-Win\install\msvc140\SimGear\include\simgear/structure/SGSharedPtr.hxx(90):
error C3861: 'put': identifier not found (compiling source file
G:\Jenkins\workspace\FlightGear-Win\build32\src\GUI\fglauncher_automoc.cpp)
[G:\Jenkins\workspace\FlightGear-Win\build32\src\GUI\fglauncher.vcxproj]
G:\Jenkins\workspace\FlightGear-Win\install\msvc140\SimGear\include\simgear/structure/SGSharedPtr.hxx(90):
warning C4150: deletion of pointer to incomplete type
'simgear::pkg::Install'; no destructor called (compiling source file
G:\Jenkins\workspace\FlightGear-Win\build32\src\GUI\fglauncher_automoc.cpp)
[G:\Jenkins\workspace\FlightGear-Win\build32\src\GUI\fglauncher.vcxproj]

G:\Jenkins\workspace\FlightGear-Win\install\msvc140\SimGear\include\simgear/package/Package.hxx(40):
note: see declaration of 'simgear::pkg::Install' (compiling source file
G:\Jenkins\workspace\FlightGear-Win\build32\src\GUI\fglauncher_automoc.cpp)
Done Building Project
"G:\Jenkins\workspace\FlightGear-Win\build32\src\GUI\fglauncher.vcxproj"
(default targets) -- FAILED.
The target "BeforeGenerateProjectPriFile" listed in a BeforeTargets
attribute at "C:\Program Files
(x86)\MSBuild\Microsoft\NuGet\Microsoft.NuGet.targets (186,61)" does not
exist in the project, and will be ignored.
Project "G:\Jenkins\workspace\FlightGear-Win\build32\src\Main\fgfs.vcxproj"
(12) is building
"G:\Jenkins\workspace\FlightGear-Win\build32\src\EmbeddedResources\fgrcc.vcxproj"
(14) on node 1 (default targets).
InitializeBuildStatus:
Creating "fgrcc.dir\RelWithDebInfo\fgrcc.tlog\unsuccessfulbuild" because
"AlwaysCreate" was specified.
CustomBuild:
All outputs are up-to-date.
ClCompile:
All outputs are up-to-date.
Link:
All outputs are up-to-date.
fgrcc.vcxproj ->
G:\Jenkins\workspace\FlightGear-Win\build32\src\EmbeddedResources\RelWithDebInfo\fgrcc.exe
FinalizeBuildStatus:
Deleting file "fgrcc.dir\RelWithDebInfo\fgrcc.tlog\unsuccessfulbuild".
Touching "fgrcc.dir\RelWithDebInfo\fgrcc.tlog\fgrcc.lastbuildstate".
Done Building Project
"G:\Jenkins\workspace\FlightGear-Win\build32\src\EmbeddedResources\fgrcc.vcxproj"
(default targets).
The target "BeforeGenerateProjectPriFile" listed in a BeforeTargets
attribute at "C:\Program Files
(x86)\MSBuild\Microsoft\NuGet\Microsoft.NuGet.targets (186,61)" does not
exist in the project, and will be ignored.
Project "G:\Jenkins\workspace\FlightGear-Win\build32\src\Main\fgfs.vcxproj"
(12) is building
"G:\Jenkins\workspace\FlightGear-Win\build32\3rdparty\sqlite3\fgsqlite3.vcxproj"
(15) on node 1 (default targets).
InitializeBuildStatus:
Creating "fgsqlite3.dir\RelWithDebInfo\fgsqlite3.tlog\unsuccessfulbuild"
because "AlwaysCreate" was specified.
CustomBuild:
All outputs are up-to-date.
ClCompile:
All outputs are up-to-date.
Lib:
All outputs are up-to-date.
fgsqlite3.vcxproj ->
G:\Jenkins\workspace\FlightGear-Win\build32\3rdparty\sqlite3\RelWithDebInfo\fgsqlite3.lib
FinalizeBuildStatus:
Deleting file
"fgsqlite3.dir\RelWithDebInfo\fgsqlite3.tlog\unsuccessfulbuild".
Touching
"fgsqlite3.dir\RelWithDebInfo\fgsqlite3.tlog\fgsqlite3.lastbuildstate".
Done Building Project
"G:\Jenkins\workspace\FlightGear-Win\build32\3rdparty\sqlite3\fgsqlite3.vcxproj"
(default targets).
The target "BeforeGenerateProjectPriFile" listed in a BeforeTargets
attribute at "C:\Program Files
(x86)\MSBuild\Microsoft\NuGet\Microsoft.NuGet.targets (186,61)" does not
exist in the project, and will be ignored.
Project "G:\Jenkins\workspace\FlightGear-Win\build32\src\Main\fgfs.vcxproj"
(12) is building
"G:\Jenkins\workspace\FlightGear-Win\build32\3rdparty\flite_hts_engine\flite_hts.vcxproj"
(16) on node 1 (default targets).
InitializeBuildStatus:
Creating "flite_hts.dir\RelWithDebInfo\flite_hts.tlog\unsuccessfulbuild"
because "AlwaysCreate" was specified.
CustomBuild:
All outputs are up-to-date.
ClCompile:
All outputs are up-to-date.
Lib:
All outputs are up-to-date.
flite_hts.vcxproj ->
G:\Jenkins\workspace\FlightGear-Win\build32\3rdparty\flite_hts_engine\RelWithDebInfo\flite_hts.lib
FinalizeBuildStatus:
Deleting file
"flite_hts.dir\RelWithDebInfo\flite_hts.tlog\unsuccessfulbuild".
Touching
"flite_hts.dir\RelWithDebInfo\flite_hts.tlog\flite_hts.lastbuildstate".
Done Building Project
"G:\Jenkins\workspace\FlightGear-Win\build32\3rdparty\flite_hts_engine\flite_hts.vcxproj"
(default targets).
The target "BeforeGenerateProjectPriFile" listed in a BeforeTargets
attribute at "C:\Program Files
(x86)\MSBuild\Microsoft\NuGet\Microsoft.NuGet.targets (186,61)" does not
exist in the project, and will be ignored.
Project "G:\Jenkins\workspace\FlightGear-Win\build32\src\Main\fgfs.vcxproj"
(12) is building
"G:\Jenkins\workspace\FlightGear-Win\build32\3rdparty\hts_engine_API\hts_engine.vcxproj"
(17) on node 1 (default targets).
InitializeBuildStatus:
Creating
"hts_engine.dir\RelWithDebInfo\hts_engine.tlog\unsuccessfulbuild" because
"AlwaysCreate" was specified.
CustomBuild:
All outputs are up-to-date.
ClCompile:
All outputs are up-to-date.
Lib:
All outputs are up-to-date.
hts_engine.vcxproj ->
G:\Jenkins\workspace\FlightGear-Win\build32\3rdparty\hts_engine_API\RelWithDebInfo\hts_engine.lib
FinalizeBuildStatus:
Deleting file
"hts_engine.dir\RelWithDebInfo\hts_engine.tlog\unsuccessfulbuild".
Touching
"hts_engine.dir\RelWithDebInfo\hts_engine.tlog\hts_engine.lastbuildstate".
Done Building Project
"G:\Jenkins\workspace\FlightGear-Win\build32\3rdparty\hts_engine_API\hts_engine.vcxproj"
(default targets).
Done Building Project
"G:\Jenkins\workspace\FlightGear-Win\build32\src\Main\fgfs.vcxproj"
(default targets) -- FAILED.
The target "BeforeGenerateProjectPriFile" listed in a BeforeTargets
attribute at "C:\Program Files
(x86)\MSBuild\Microsoft\NuGet\Microsoft.NuGet.targets (186,61)" does not
exist in the project, and will be ignored.
Project "G:\Jenkins\workspace\FlightGear-Win\build32\ALL_BUILD.vcxproj" (2)
is building
"G:\Jenkins\workspace\FlightGear-Win\build32\src\Input\fgjs.vcxproj" (18)
on node 1 (default targets).
InitializeBuildStatus:
Creating "fgjs.dir\RelWithDebInfo\fgjs.tlog\unsuccessfulbuild" because
"AlwaysCreate" was specified.
CustomBuild:
All outputs are up-to-date.
ClCompile:
All outputs are up-to-date.
Link:
All outputs are up-to-date.
fgjs.vcxproj ->
G:\Jenkins\workspace\FlightGear-Win\build32\src\Input\RelWithDebInfo\fgjs.exe
FinalizeBuildStatus:
Deleting file "fgjs.dir\RelWithDebInfo\fgjs.tlog\unsuccessfulbuild".
Touching "fgjs.dir\RelWithDebInfo\fgjs.tlog\fgjs.lastbuildstate".
Done Building Project
"G:\Jenkins\workspace\FlightGear-Win\build32\src\Input\fgjs.vcxproj"
(default targets).
The target "BeforeGenerateProjectPriFile" listed in a BeforeTargets
attribute at "C:\Program Files
(x86)\MSBuild\Microsoft\NuGet\Microsoft.NuGet.targets (186,61)" does not
exist in the project, and will be ignored.
Project "G:\Jenkins\workspace\FlightGear-Win\build32\ALL_BUILD.vcxproj" (2)
is building
"G:\Jenkins\workspace\FlightGear-Win\build32\utils\traffic\fgtraffic.vcxproj"
(19) on node 1 (default targets).
InitializeBuildStatus:
Creating "fgtraffic.dir\RelWithDebInfo\fgtraffic.tlog\unsuccessfulbuild"
because "AlwaysCreate" was specified.
CustomBuild:
All outputs are up-to-date.
ClCompile:
All outputs are up-to-date.
Link:
All outputs are up-to-date.
fgtraffic.vcxproj ->
G:\Jenkins\workspace\FlightGear-Win\build32\utils\traffic\RelWithDebInfo\fgtraffic.exe
FinalizeBuildStatus:
Deleting file
"fgtraffic.dir\RelWithDebInfo\fgtraffic.tlog\unsuccessfulbuild".
Touching
"fgtraffic.dir\RelWithDebInfo\fgtraffic.tlog\fgtraffic.lastbuildstate".
Done Building Project
"G:\Jenkins\workspace\FlightGear-Win\build32\utils\traffic\fgtraffic.vcxproj"
(default targets).
The target "BeforeGenerateProjectPriFile" listed in a BeforeTargets
attribute at "C:\Program Files
(x86)\MSBuild\Microsoft\NuGet\Microsoft.NuGet.targets (186,61)" does not
exist in the project, and will be ignored.
Project "G:\Jenkins\workspace\FlightGear-Win\build32\ALL_BUILD.vcxproj" (2)
is building
"G:\Jenkins\workspace\FlightGear-Win\build32\utils\fgviewer\fgviewer.vcxproj"
(20) on node 1 (default targets).
InitializeBuildStatus:
Creating "fgviewer.dir\RelWithDebInfo\fgviewer.tlog\unsuccessfulbuild"
because "AlwaysCreate" was specified.
CustomBuild:
All outputs are up-to-date.
ClCompile:
All outputs are up-to-date.
Link:
All outputs are up-to-date.
fgviewer.vcxproj ->
G:\Jenkins\workspace\FlightGear-Win\build32\utils\fgviewer\RelWithDebInfo\fgviewer.exe
FinalizeBuildStatus:
Deleting file
"fgviewer.dir\RelWithDebInfo\fgviewer.tlog\unsuccessfulbuild".
Touching
"fgviewer.dir\RelWithDebInfo\fgviewer.tlog\fgviewer.lastbuildstate".
Done Building Project
"G:\Jenkins\workspace\FlightGear-Win\build32\utils\fgviewer\fgviewer.vcxproj"
(default targets).
The target "BeforeGenerateProjectPriFile" listed in a BeforeTargets
attribute at "C:\Program Files
(x86)\MSBuild\Microsoft\NuGet\Microsoft.NuGet.targets (186,61)" does not
exist in the project, and will be ignored.
Project "G:\Jenkins\workspace\FlightGear-Win\build32\ALL_BUILD.vcxproj" (2)
is building
"G:\Jenkins\workspace\FlightGear-Win\build32\src\Input\js_demo.vcxproj"
(21) on node 1 (default targets).
InitializeBuildStatus:
Creating "js_demo.dir\RelWithDebInfo\js_demo.tlog\unsuccessfulbuild"
because "AlwaysCreate" was specified.
CustomBuild:
All outputs are up-to-date.
ClCompile:
All outputs are up-to-date.
Link:
All outputs are up-to-date.
js_demo.vcxproj ->
G:\Jenkins\workspace\FlightGear-Win\build32\src\Input\RelWithDebInfo\js_demo.exe
FinalizeBuildStatus:
Deleting file "js_demo.dir\RelWithDebInfo\js_demo.tlog\unsuccessfulbuild".
Touching "js_demo.dir\RelWithDebInfo\js_demo.tlog\js_demo.lastbuildstate".
Done Building Project
"G:\Jenkins\workspace\FlightGear-Win\build32\src\Input\js_demo.vcxproj"
(default targets).
The target "BeforeGenerateProjectPriFile" listed in a BeforeTargets
attribute at "C:\Program Files
(x86)\MSBuild\Microsoft\NuGet\Microsoft.NuGet.targets (186,61)" does not
exist in the project, and will be ignored.
Project "G:\Jenkins\workspace\FlightGear-Win\build32\ALL_BUILD.vcxproj" (2)
is building
"G:\Jenkins\workspace\FlightGear-Win\build32\src\Main\metar.vcxproj" (22)
on node 1 (default targets).
InitializeBuildStatus:
Creating "metar.dir\RelWithDebInfo\metar.tlog\unsuccessfulbuild" because
"AlwaysCreate" was specified.
CustomBuild:
All outputs are up-to-date.
ClCompile:
All outputs are up-to-date.
Link:
All outputs are up-to-date.
metar.vcxproj ->
G:\Jenkins\workspace\FlightGear-Win\build32\src\Main\RelWithDebInfo\metar.exe
FinalizeBuildStatus:
Deleting file "metar.dir\RelWithDebInfo\metar.tlog\unsuccessfulbuild".
Touching "metar.dir\RelWithDebInfo\metar.tlog\metar.lastbuildstate".
Done Building Project
"G:\Jenkins\workspace\FlightGear-Win\build32\src\Main\metar.vcxproj"
(default targets).
The target "BeforeGenerateProjectPriFile" listed in a BeforeTargets
attribute at "C:\Program Files
(x86)\MSBuild\Microsoft\NuGet\Microsoft.NuGet.targets (186,61)" does not
exist in the project, and will be ignored.
Project "G:\Jenkins\workspace\FlightGear-Win\build32\ALL_BUILD.vcxproj" (2)
is building
"G:\Jenkins\workspace\FlightGear-Win\build32\src\FDM\YASim\yasim.vcxproj"
(23) on node 1 (default targets).
InitializeBuildStatus:
Creating "yasim.dir\RelWithDebInfo\yasim.tlog\unsuccessfulbuild" because
"AlwaysCreate" was specified.
CustomBuild:
All outputs are up-to-date.
ClCompile:
All outputs are up-to-date.
Link:
All outputs are up-to-date.
yasim.vcxproj ->
G:\Jenkins\workspace\FlightGear-Win\build32\src\FDM\YASim\RelWithDebInfo\yasim.exe
FinalizeBuildStatus:
Deleting file "yasim.dir\RelWithDebInfo\yasim.tlog\unsuccessfulbuild".
Touching "yasim.dir\RelWithDebInfo\yasim.tlog\yasim.lastbuildstate".
Done Building Project
"G:\Jenkins\workspace\FlightGear-Win\build32\src\FDM\YASim\yasim.vcxproj"
(default targets).
The target "BeforeGenerateProjectPriFile" listed in a BeforeTargets
attribute at "C:\Program Files
(x86)\MSBuild\Microsoft\NuGet\Microsoft.NuGet.targets (186,61)" does not
exist in the project, and will be ignored.
Project "G:\Jenkins\workspace\FlightGear-Win\build32\ALL_BUILD.vcxproj" (2)
is building
"G:\Jenkins\workspace\FlightGear-Win\build32\src\FDM\YASim\yasim-atmotest.vcxproj"
(24) on node 1 (default targets).
InitializeBuildStatus:
Creating
"yasim-atmotest.dir\RelWithDebInfo\yasim-atmotest.tlog\unsuccessfulbuild"
because "AlwaysCreate" was specified.
CustomBuild:
All outputs are up-to-date.
ClCompile:
All outputs are up-to-date.
Link:
All outputs are up-to-date.
yasim-atmotest.vcxproj ->
G:\Jenkins\workspace\FlightGear-Win\build32\src\FDM\YASim\RelWithDebInfo\yasim-atmotest.exe
FinalizeBuildStatus:
Deleting file
"yasim-atmotest.dir\RelWithDebInfo\yasim-atmotest.tlog\unsuccessfulbuild".
Touching
"yasim-atmotest.dir\RelWithDebInfo\yasim-atmotest.tlog\yasim-atmotest.lastbuildstate".
Done Building Project
"G:\Jenkins\workspace\FlightGear-Win\build32\src\FDM\YASim\yasim-atmotest.vcxproj"
(default targets).
The target "BeforeGenerateProjectPriFile" listed in a BeforeTargets
attribute at "C:\Program Files
(x86)\MSBuild\Microsoft\NuGet\Microsoft.NuGet.targets (186,61)" does not
exist in the project, and will be ignored.
Project "G:\Jenkins\workspace\FlightGear-Win\build32\ALL_BUILD.vcxproj" (2)
is building
"G:\Jenkins\workspace\FlightGear-Win\build32\src\FDM\YASim\yasim-proptest.vcxproj"
(25) on node 1 (default targets).
InitializeBuildStatus:
Creating
"yasim-proptest.dir\RelWithDebInfo\yasim-proptest.tlog\unsuccessfulbuild"
because "AlwaysCreate" was specified.
CustomBuild:
All outputs are up-to-date.
ClCompile:
All outputs are up-to-date.
Link:
All outputs are up-to-date.
yasim-proptest.vcxproj ->
G:\Jenkins\workspace\FlightGear-Win\build32\src\FDM\YASim\RelWithDebInfo\yasim-proptest.exe
FinalizeBuildStatus:
Deleting file
"yasim-proptest.dir\RelWithDebInfo\yasim-proptest.tlog\unsuccessfulbuild".
Touching
"yasim-proptest.dir\RelWithDebInfo\yasim-proptest.tlog\yasim-proptest.lastbuildstate".
Done Building Project
"G:\Jenkins\workspace\FlightGear-Win\build32\src\FDM\YASim\yasim-proptest.vcxproj"
(default targets).
Done Building Project
"G:\Jenkins\workspace\FlightGear-Win\build32\ALL_BUILD.vcxproj" (default
targets) -- FAILED.
Done Building Project
"G:\Jenkins\workspace\FlightGear-Win\build32\INSTALL.vcxproj" (default
targets) -- FAILED.

Build FAILED.

"G:\Jenkins\workspace\FlightGear-Win\build32\INSTALL.vcxproj" (default
target) (1) ->
"G:\Jenkins\workspace\FlightGear-Win\build32\ALL_BUILD.vcxproj" (default
target) (2) ->
"G:\Jenkins\workspace\FlightGear-Win\build32\src\Main\fgfs.vcxproj"
(default target) (12) ->
"G:\Jenkins\workspace\FlightGear-Win\build32\src\GUI\fglauncher.vcxproj"
(default target) (13) ->
(ClCompile target) ->

G:\Jenkins\workspace\FlightGear-Win\install\msvc140\SimGear\include\simgear/structure/SGSharedPtr.hxx(90):
warning C4150: deletion of pointer to incomplete type
'simgear::pkg::Install'; no destructor called (compiling source file
G:\Jenkins\workspace\FlightGear-Win\source\src\GUI\AircraftItemDelegate.cxx)
[G:\Jenkins\workspace\FlightGear-Win\build32\src\GUI\fglauncher.vcxproj]

G:\Jenkins\workspace\FlightGear-Win\install\msvc140\SimGear\include\simgear/structure/SGSharedPtr.hxx(90):
warning C4150: deletion of pointer to incomplete type
'simgear::pkg::Install'; no destructor called (compiling source file
G:\Jenkins\workspace\FlightGear-Win\source\src\GUI\CatalogListModel.cxx)
[G:\Jenkins\workspace\FlightGear-Win\build32\src\GUI\fglauncher.vcxproj]

G:\Jenkins\workspace\FlightGear-Win\install\msvc140\SimGear\include\simgear/structure/SGSharedPtr.hxx(90):
warning C4150: deletion of pointer to incomplete type
'simgear::pkg::Install'; no destructor called (compiling source file
G:\Jenkins\workspace\FlightGear-Win\source\src\GUI\AddCatalogDialog.cxx)
[G:\Jenkins\workspace\FlightGear-Win\build32\src\GUI\fglauncher.vcxproj]

G:\Jenkins\workspace\FlightGear-Win\install\msvc140\SimGear\include\simgear/structure/SGSharedPtr.hxx(90):
warning C4150: deletion of pointer to incomplete type
'simgear::pkg::Install'; no destructor called (compiling source file
G:\Jenkins\workspace\FlightGear-Win\source\src\GUI\PathsDialog.cxx)
[G:\Jenkins\workspace\FlightGear-Win\build32\src\GUI\fglauncher.vcxproj]

G:\Jenkins\workspace\FlightGear-Win\install\msvc140\SimGear\include\simgear/structure/SGSharedPtr.hxx(90):
warning C4150: deletion of pointer to incomplete type
'simgear::pkg::Install'; no destructor called (compiling source file
G:\Jenkins\workspace\FlightGear-Win\source\src\GUI\AircraftSearchFilterModel.cxx)
[G:\Jenkins\workspace\FlightGear-Win\build32\src\GUI\fglauncher.vcxproj]

G:\Jenkins\workspace\FlightGear-Win\install\msvc140\SimGear\include\simgear/structure/SGSharedPtr.hxx(90):
warning C4150: deletion of pointer to incomplete type
'simgear::pkg::Install'; no destructor called (compiling source file
G:\Jenkins\workspace\FlightGear-Win\build32\src\GUI\fglauncher_automoc.cpp)
[G:\Jenkins\workspace\FlightGear-Win\build32\src\GUI\fglauncher.vcxproj]


"G:\Jenkins\workspace\FlightGear-Win\build32\INSTALL.vcxproj" (default
target) (1) ->
"G:\Jenkins\workspace\FlightGear-Win\build32\ALL_BUILD.vcxproj" (default
target) (2) ->
"G:\Jenkins\workspace\FlightGear-Win\build32\src\Main\fgfs.vcxproj"
(default target) (12) ->
"G:\Jenkins\workspace\FlightGear-Win\build32\src\GUI\fglauncher.vcxproj"
(default target) (13) ->
(ClCompile target) ->

G:\Jenkins\workspace\FlightGear-Win\install\msvc140\SimGear\include\simgear/structure/SGSharedPtr.hxx(90):
error C2027: use of undefined type 'simgear::pkg::Install' (compiling
source file
G:\Jenkins\workspace\FlightGear-Win\source\src\GUI\AircraftItemDelegate.cxx)
[G:\Jenkins\workspace\FlightGear-Win\build32\src\GUI\fglauncher.vcxproj]

G:\Jenkins\workspace\FlightGear-Win\install\msvc140\SimGear\include\simgear/structure/SGSharedPtr.hxx(90):
error C3861: 'put': identifier not found (compiling source file
G:\Jenkins\workspace\FlightGear-Win\source\src\GUI\AircraftItemDelegate.cxx)
[G:\Jenkins\workspace\FlightGear-Win\build32\src\GUI\fglauncher.vcxproj]

G:\Jenkins\workspace\FlightGear-Win\install\msvc140\SimGear\include\simgear/structure/SGSharedPtr.hxx(90):
error C2027: use of undefined type 'simgear::pkg::Install' (compiling
source file
G:\Jenkins\workspace\FlightGear-Win\source\src\GUI\CatalogListModel.cxx)
[G:\Jenkins\workspace\FlightGear-Win\build32\src\GUI\fglauncher.vcxproj]

G:\Jenkins\workspace\FlightGear-Win\install\msvc140\SimGear\include\simgear/structure/SGSharedPtr.hxx(90):
error C3861: 'put': identifier not found (compiling source file
G:\Jenkins\workspace\FlightGear-Win\source\src\GUI\CatalogListModel.cxx)
[G:\Jenkins\workspace\FlightGear-Win\build32\src\GUI\fglauncher.vcxproj]

G:\Jenkins\workspace\FlightGear-Win\install\msvc140\SimGear\include\simgear/structure/SGSharedPtr.hxx(90):
error C2027: use of undefined type 'simgear::pkg::Install' (compiling
source file
G:\Jenkins\workspace\FlightGear-Win\source\src\GUI\AddCatalogDialog.cxx)
[G:\Jenkins\workspace\FlightGear-Win\build32\src\GUI\fglauncher.vcxproj]

G:\Jenkins\workspace\FlightGear-Win\install\msvc140\SimGear\include\simgear/structure/SGSharedPtr.hxx(90):
error C3861: 'put': identifier not found (compiling source file
G:\Jenkins\workspace\FlightGear-Win\source\src\GUI\AddCatalogDialog.cxx)
[G:\Jenkins\workspace\FlightGear-Win\build32\src\GUI\fglauncher.vcxproj]

G:\Jenkins\workspace\FlightGear-Win\install\msvc140\SimGear\include\simgear/structure/SGSharedPtr.hxx(90):
error C2027: use of undefined type 'simgear::pkg::Install' (compiling
source file
G:\Jenkins\workspace\FlightGear-Win\source\src\GUI\PathsDialog.cxx)
[G:\Jenkins\workspace\FlightGear-Win\build32\src\GUI\fglauncher.vcxproj]

G:\Jenkins\workspace\FlightGear-Win\install\msvc140\SimGear\include\simgear/structure/SGSharedPtr.hxx(90):
error C3861: 'put': identifier not found (compiling source file
G:\Jenkins\workspace\FlightGear-Win\source\src\GUI\PathsDialog.cxx)
[G:\Jenkins\workspace\FlightGear-Win\build32\src\GUI\fglauncher.vcxproj]

G:\Jenkins\workspace\FlightGear-Win\install\msvc140\SimGear\include\simgear/structure/SGSharedPtr.hxx(90):
error C2027: use of undefined type 'simgear::pkg::Install' (compiling
source file
G:\Jenkins\workspace\FlightGear-Win\source\src\GUI\AircraftSearchFilterModel.cxx)
[G:\Jenkins\workspace\FlightGear-Win\build32\src\GUI\fglauncher.vcxproj]

G:\Jenkins\workspace\FlightGear-Win\install\msvc140\SimGear\include\simgear/structure/SGSharedPtr.hxx(90):
error C3861: 'put': identifier not found (compiling source file
G:\Jenkins\workspace\FlightGear-Win\source\src\GUI\AircraftSearchFilterModel.cxx)
[G:\Jenkins\workspace\FlightGear-Win\build32\src\GUI\fglauncher.vcxproj]

G:\Jenkins\workspace\FlightGear-Win\install\msvc140\SimGear\include\simgear/structure/SGSharedPtr.hxx(90):
error C2027: use of undefined type 'simgear::pkg::Install' (compiling
source file
G:\Jenkins\workspace\FlightGear-Win\build32\src\GUI\fglauncher_automoc.cpp)
[G:\Jenkins\workspace\FlightGear-Win\build32\src\GUI\fglauncher.vcxproj]

G:\Jenkins\workspace\FlightGear-Win\install\msvc140\SimGear\include\simgear/structure/SGSharedPtr.hxx(90):
error C3861: 'put': identifier not found (compiling source file
G:\Jenkins\workspace\FlightGear-Win\build32\src\GUI\fglauncher_automoc.cpp)
[G:\Jenkins\workspace\FlightGear-Win\build32\src\GUI\fglauncher.vcxproj]

6 Warning(s)
12 Error(s)

Time Elapsed 00:00:31.38

G:\Jenkins\workspace\FlightGear-Win\build32>exit 1
Build step 'Execute Windows batch command' marked build as failure
Archiving artifacts
IRC notifier plugin: Sending notification to: #builds

------------------------------------------------------------------------------
Check out the vibrant tech community on one of the world's most
engaging tech sites, Slashdot.org! http://sdm.link/slashdot
_______________________________________________
Flightgear-builds mailing list
Flightgear-***@lists.sourceforge.net
https://lists.sourceforge.net/lists/listinfo/flightgear-builds
--

Torsten Dreyer
James Turner
2017-07-18 15:29:41 UTC
Permalink
> On 18 Jul 2017, at 15:17, Torsten Dreyer <***@t3r.de> wrote:
>
> the windows build of fg has been flagged red for a month or so.
> I thought this might have been due to some stale files of the preceeding SimGear build but wiping the workspace of both projects (sg + fg) did not help.
>
> If anybody has an idea what might cause this, please...
>
> We need a green Jenkins for the release in just a few weeks.

Will take a look, I think I confused something, but it builds on my local Windows box (or did, last time I checked), so not sure.

Kind regards,
James
Ron H
2017-07-18 15:17:19 UTC
Permalink
I had this issue on my personal build - I noted this in a message Jul 7th 2017.


https://sourceforge.net/p/flightgear/mailman/message/35933348/


Adding includes in a few files fixed it for me.


Ron


Windows 10, VS2015


________________________________
From: Torsten Dreyer <***@t3r.de>
Sent: July 18, 2017 10:17 AM
To: FlightGear developers discussions
Subject: [Flightgear-devel] Fwd: [Flightgear-builds] Build failed in Jenkins: FlightGear-Win #2880

Hi,

the windows build of fg has been flagged red for a month or so.
I thought this might have been due to some stale files of the preceeding SimGear build but wiping the workspace of both projects (sg + fg) did not help.

If anybody has an idea what might cause this, please...

We need a green Jenkins for the release in just a few weeks.

Torsten

---------- Forwarded message ---------
From: <***@deltasoft.com<mailto:***@deltasoft.com>>
Date: Di., 18. Juli 2017 um 16:04 Uhr
Subject: [Flightgear-builds] Build failed in Jenkins: FlightGear-Win #2880
To: <flightgear-***@lists.sourceforge.net<mailto:flightgear-***@lists.sourceforge.net>>


See <http://build.flightgear.org:8080/job/FlightGear-Win/2880/display/redirect>

------------------------------------------
[...truncated 34.67 KB...]
G:\Jenkins\workspace\FlightGear-Win\install\msvc140\SimGear\include\simgear/package/Delegate.hxx(84): note: see reference to class template instantiation 'SGSharedPtr<simgear::pkg::Install>' being compiled (compiling source file G:\Jenkins\workspace\FlightGear-Win\source\src\GUI\PathsDialog.cxx)
G:\Jenkins\workspace\FlightGear-Win\install\msvc140\SimGear\include\simgear/structure/SGSharedPtr.hxx(90): error C3861: 'put': identifier not found (compiling source file G:\Jenkins\workspace\FlightGear-Win\source\src\GUI\PathsDialog.cxx) [G:\Jenkins\workspace\FlightGear-Win\build32\src\GUI\fglauncher.vcxproj]
G:\Jenkins\workspace\FlightGear-Win\install\msvc140\SimGear\include\simgear/structure/SGSharedPtr.hxx(90): warning C4150: deletion of pointer to incomplete type 'simgear::pkg::Install'; no destructor called (compiling source file G:\Jenkins\workspace\FlightGear-Win\source\src\GUI\PathsDialog.cxx) [G:\Jenkins\workspace\FlightGear-Win\build32\src\GUI\fglauncher.vcxproj]
G:\Jenkins\workspace\FlightGear-Win\install\msvc140\SimGear\include\simgear/package/Package.hxx(40): note: see declaration of 'simgear::pkg::Install' (compiling source file G:\Jenkins\workspace\FlightGear-Win\source\src\GUI\PathsDialog.cxx)
AircraftSearchFilterModel.cxx
G:\Jenkins\workspace\FlightGear-Win\install\msvc140\SimGear\include\simgear/structure/SGSharedPtr.hxx(90): error C2027: use of undefined type 'simgear::pkg::Install' (compiling source file G:\Jenkins\workspace\FlightGear-Win\source\src\GUI\AircraftSearchFilterModel.cxx) [G:\Jenkins\workspace\FlightGear-Win\build32\src\GUI\fglauncher.vcxproj]
G:\Jenkins\workspace\FlightGear-Win\install\msvc140\SimGear\include\simgear/package/Package.hxx(40): note: see declaration of 'simgear::pkg::Install' (compiling source file G:\Jenkins\workspace\FlightGear-Win\source\src\GUI\AircraftSearchFilterModel.cxx)
G:\Jenkins\workspace\FlightGear-Win\install\msvc140\SimGear\include\simgear/structure/SGSharedPtr.hxx(90): note: while compiling class template member function 'void SGSharedPtr<simgear::pkg::Install>::reset(void)' (compiling source file G:\Jenkins\workspace\FlightGear-Win\source\src\GUI\AircraftSearchFilterModel.cxx)
G:\Jenkins\workspace\FlightGear-Win\install\msvc140\SimGear\include\simgear/structure/SGSharedPtr.hxx(66): note: see reference to function template instantiation 'void SGSharedPtr<simgear::pkg::Install>::reset(void)' being compiled (compiling source file G:\Jenkins\workspace\FlightGear-Win\source\src\GUI\AircraftSearchFilterModel.cxx)
G:\Jenkins\workspace\FlightGear-Win\install\msvc140\SimGear\include\simgear/package/Delegate.hxx(84): note: see reference to class template instantiation 'SGSharedPtr<simgear::pkg::Install>' being compiled (compiling source file G:\Jenkins\workspace\FlightGear-Win\source\src\GUI\AircraftSearchFilterModel.cxx)
G:\Jenkins\workspace\FlightGear-Win\install\msvc140\SimGear\include\simgear/structure/SGSharedPtr.hxx(90): error C3861: 'put': identifier not found (compiling source file G:\Jenkins\workspace\FlightGear-Win\source\src\GUI\AircraftSearchFilterModel.cxx) [G:\Jenkins\workspace\FlightGear-Win\build32\src\GUI\fglauncher.vcxproj]
G:\Jenkins\workspace\FlightGear-Win\install\msvc140\SimGear\include\simgear/structure/SGSharedPtr.hxx(90): warning C4150: deletion of pointer to incomplete type 'simgear::pkg::Install'; no destructor called (compiling source file G:\Jenkins\workspace\FlightGear-Win\source\src\GUI\AircraftSearchFilterModel.cxx) [G:\Jenkins\workspace\FlightGear-Win\build32\src\GUI\fglauncher.vcxproj]
G:\Jenkins\workspace\FlightGear-Win\install\msvc140\SimGear\include\simgear/package/Package.hxx(40): note: see declaration of 'simgear::pkg::Install' (compiling source file G:\Jenkins\workspace\FlightGear-Win\source\src\GUI\AircraftSearchFilterModel.cxx)
fglauncher_automoc.cpp
G:\Jenkins\workspace\FlightGear-Win\install\msvc140\SimGear\include\simgear/structure/SGSharedPtr.hxx(90): error C2027: use of undefined type 'simgear::pkg::Install' (compiling source file G:\Jenkins\workspace\FlightGear-Win\build32\src\GUI\fglauncher_automoc.cpp) [G:\Jenkins\workspace\FlightGear-Win\build32\src\GUI\fglauncher.vcxproj]
G:\Jenkins\workspace\FlightGear-Win\install\msvc140\SimGear\include\simgear/package/Package.hxx(40): note: see declaration of 'simgear::pkg::Install' (compiling source file G:\Jenkins\workspace\FlightGear-Win\build32\src\GUI\fglauncher_automoc.cpp)
G:\Jenkins\workspace\FlightGear-Win\install\msvc140\SimGear\include\simgear/structure/SGSharedPtr.hxx(90): note: while compiling class template member function 'void SGSharedPtr<simgear::pkg::Install>::reset(void)' (compiling source file G:\Jenkins\workspace\FlightGear-Win\build32\src\GUI\fglauncher_automoc.cpp)
G:\Jenkins\workspace\FlightGear-Win\install\msvc140\SimGear\include\simgear/structure/SGSharedPtr.hxx(66): note: see reference to function template instantiation 'void SGSharedPtr<simgear::pkg::Install>::reset(void)' being compiled (compiling source file G:\Jenkins\workspace\FlightGear-Win\build32\src\GUI\fglauncher_automoc.cpp)
G:\Jenkins\workspace\FlightGear-Win\install\msvc140\SimGear\include\simgear/package/Delegate.hxx(84): note: see reference to class template instantiation 'SGSharedPtr<simgear::pkg::Install>' being compiled (compiling source file G:\Jenkins\workspace\FlightGear-Win\build32\src\GUI\fglauncher_automoc.cpp)
G:\Jenkins\workspace\FlightGear-Win\install\msvc140\SimGear\include\simgear/structure/SGSharedPtr.hxx(90): error C3861: 'put': identifier not found (compiling source file G:\Jenkins\workspace\FlightGear-Win\build32\src\GUI\fglauncher_automoc.cpp) [G:\Jenkins\workspace\FlightGear-Win\build32\src\GUI\fglauncher.vcxproj]
G:\Jenkins\workspace\FlightGear-Win\install\msvc140\SimGear\include\simgear/structure/SGSharedPtr.hxx(90): warning C4150: deletion of pointer to incomplete type 'simgear::pkg::Install'; no destructor called (compiling source file G:\Jenkins\workspace\FlightGear-Win\build32\src\GUI\fglauncher_automoc.cpp) [G:\Jenkins\workspace\FlightGear-Win\build32\src\GUI\fglauncher.vcxproj]
G:\Jenkins\workspace\FlightGear-Win\install\msvc140\SimGear\include\simgear/package/Package.hxx(40): note: see declaration of 'simgear::pkg::Install' (compiling source file G:\Jenkins\workspace\FlightGear-Win\build32\src\GUI\fglauncher_automoc.cpp)
Done Building Project "G:\Jenkins\workspace\FlightGear-Win\build32\src\GUI\fglauncher.vcxproj" (default targets) -- FAILED.
The target "BeforeGenerateProjectPriFile" listed in a BeforeTargets attribute at "C:\Program Files (x86)\MSBuild\Microsoft\NuGet\Microsoft.NuGet.targets (186,61)" does not exist in the project, and will be ignored.
Project "G:\Jenkins\workspace\FlightGear-Win\build32\src\Main\fgfs.vcxproj" (12) is building "G:\Jenkins\workspace\FlightGear-Win\build32\src\EmbeddedResources\fgrcc.vcxproj" (14) on node 1 (default targets).
InitializeBuildStatus:
Creating "fgrcc.dir\RelWithDebInfo\fgrcc.tlog\unsuccessfulbuild" because "AlwaysCreate" was specified.
CustomBuild:
All outputs are up-to-date.
ClCompile:
All outputs are up-to-date.
Link:
All outputs are up-to-date.
fgrcc.vcxproj -> G:\Jenkins\workspace\FlightGear-Win\build32\src\EmbeddedResources\RelWithDebInfo\fgrcc.exe
FinalizeBuildStatus:
Deleting file "fgrcc.dir\RelWithDebInfo\fgrcc.tlog\unsuccessfulbuild".
Touching "fgrcc.dir\RelWithDebInfo\fgrcc.tlog\fgrcc.lastbuildstate".
Done Building Project "G:\Jenkins\workspace\FlightGear-Win\build32\src\EmbeddedResources\fgrcc.vcxproj" (default targets).
The target "BeforeGenerateProjectPriFile" listed in a BeforeTargets attribute at "C:\Program Files (x86)\MSBuild\Microsoft\NuGet\Microsoft.NuGet.targets (186,61)" does not exist in the project, and will be ignored.
Project "G:\Jenkins\workspace\FlightGear-Win\build32\src\Main\fgfs.vcxproj" (12) is building "G:\Jenkins\workspace\FlightGear-Win\build32\3rdparty\sqlite3\fgsqlite3.vcxproj" (15) on node 1 (default targets).
InitializeBuildStatus:
Creating "fgsqlite3.dir\RelWithDebInfo\fgsqlite3.tlog\unsuccessfulbuild" because "AlwaysCreate" was specified.
CustomBuild:
All outputs are up-to-date.
ClCompile:
All outputs are up-to-date.
Lib:
All outputs are up-to-date.
fgsqlite3.vcxproj -> G:\Jenkins\workspace\FlightGear-Win\build32\3rdparty\sqlite3\RelWithDebInfo\fgsqlite3.lib
FinalizeBuildStatus:
Deleting file "fgsqlite3.dir\RelWithDebInfo\fgsqlite3.tlog\unsuccessfulbuild".
Touching "fgsqlite3.dir\RelWithDebInfo\fgsqlite3.tlog\fgsqlite3.lastbuildstate".
Done Building Project "G:\Jenkins\workspace\FlightGear-Win\build32\3rdparty\sqlite3\fgsqlite3.vcxproj" (default targets).
The target "BeforeGenerateProjectPriFile" listed in a BeforeTargets attribute at "C:\Program Files (x86)\MSBuild\Microsoft\NuGet\Microsoft.NuGet.targets (186,61)" does not exist in the project, and will be ignored.
Project "G:\Jenkins\workspace\FlightGear-Win\build32\src\Main\fgfs.vcxproj" (12) is building "G:\Jenkins\workspace\FlightGear-Win\build32\3rdparty\flite_hts_engine\flite_hts.vcxproj" (16) on node 1 (default targets).
InitializeBuildStatus:
Creating "flite_hts.dir\RelWithDebInfo\flite_hts.tlog\unsuccessfulbuild" because "AlwaysCreate" was specified.
CustomBuild:
All outputs are up-to-date.
ClCompile:
All outputs are up-to-date.
Lib:
All outputs are up-to-date.
flite_hts.vcxproj -> G:\Jenkins\workspace\FlightGear-Win\build32\3rdparty\flite_hts_engine\RelWithDebInfo\flite_hts.lib
FinalizeBuildStatus:
Deleting file "flite_hts.dir\RelWithDebInfo\flite_hts.tlog\unsuccessfulbuild".
Touching "flite_hts.dir\RelWithDebInfo\flite_hts.tlog\flite_hts.lastbuildstate".
Done Building Project "G:\Jenkins\workspace\FlightGear-Win\build32\3rdparty\flite_hts_engine\flite_hts.vcxproj" (default targets).
The target "BeforeGenerateProjectPriFile" listed in a BeforeTargets attribute at "C:\Program Files (x86)\MSBuild\Microsoft\NuGet\Microsoft.NuGet.targets (186,61)" does not exist in the project, and will be ignored.
Project "G:\Jenkins\workspace\FlightGear-Win\build32\src\Main\fgfs.vcxproj" (12) is building "G:\Jenkins\workspace\FlightGear-Win\build32\3rdparty\hts_engine_API\hts_engine.vcxproj" (17) on node 1 (default targets).
InitializeBuildStatus:
Creating "hts_engine.dir\RelWithDebInfo\hts_engine.tlog\unsuccessfulbuild" because "AlwaysCreate" was specified.
CustomBuild:
All outputs are up-to-date.
ClCompile:
All outputs are up-to-date.
Lib:
All outputs are up-to-date.
hts_engine.vcxproj -> G:\Jenkins\workspace\FlightGear-Win\build32\3rdparty\hts_engine_API\RelWithDebInfo\hts_engine.lib
FinalizeBuildStatus:
Deleting file "hts_engine.dir\RelWithDebInfo\hts_engine.tlog\unsuccessfulbuild".
Touching "hts_engine.dir\RelWithDebInfo\hts_engine.tlog\hts_engine.lastbuildstate".
Done Building Project "G:\Jenkins\workspace\FlightGear-Win\build32\3rdparty\hts_engine_API\hts_engine.vcxproj" (default targets).
Done Building Project "G:\Jenkins\workspace\FlightGear-Win\build32\src\Main\fgfs.vcxproj" (default targets) -- FAILED.
The target "BeforeGenerateProjectPriFile" listed in a BeforeTargets attribute at "C:\Program Files (x86)\MSBuild\Microsoft\NuGet\Microsoft.NuGet.targets (186,61)" does not exist in the project, and will be ignored.
Project "G:\Jenkins\workspace\FlightGear-Win\build32\ALL_BUILD.vcxproj" (2) is building "G:\Jenkins\workspace\FlightGear-Win\build32\src\Input\fgjs.vcxproj" (18) on node 1 (default targets).
InitializeBuildStatus:
Creating "fgjs.dir\RelWithDebInfo\fgjs.tlog\unsuccessfulbuild" because "AlwaysCreate" was specified.
CustomBuild:
All outputs are up-to-date.
ClCompile:
All outputs are up-to-date.
Link:
All outputs are up-to-date.
fgjs.vcxproj -> G:\Jenkins\workspace\FlightGear-Win\build32\src\Input\RelWithDebInfo\fgjs.exe
FinalizeBuildStatus:
Deleting file "fgjs.dir\RelWithDebInfo\fgjs.tlog\unsuccessfulbuild".
Touching "fgjs.dir\RelWithDebInfo\fgjs.tlog\fgjs.lastbuildstate".
Done Building Project "G:\Jenkins\workspace\FlightGear-Win\build32\src\Input\fgjs.vcxproj" (default targets).
The target "BeforeGenerateProjectPriFile" listed in a BeforeTargets attribute at "C:\Program Files (x86)\MSBuild\Microsoft\NuGet\Microsoft.NuGet.targets (186,61)" does not exist in the project, and will be ignored.
Project "G:\Jenkins\workspace\FlightGear-Win\build32\ALL_BUILD.vcxproj" (2) is building "G:\Jenkins\workspace\FlightGear-Win\build32\utils\traffic\fgtraffic.vcxproj" (19) on node 1 (default targets).
InitializeBuildStatus:
Creating "fgtraffic.dir\RelWithDebInfo\fgtraffic.tlog\unsuccessfulbuild" because "AlwaysCreate" was specified.
CustomBuild:
All outputs are up-to-date.
ClCompile:
All outputs are up-to-date.
Link:
All outputs are up-to-date.
fgtraffic.vcxproj -> G:\Jenkins\workspace\FlightGear-Win\build32\utils\traffic\RelWithDebInfo\fgtraffic.exe
FinalizeBuildStatus:
Deleting file "fgtraffic.dir\RelWithDebInfo\fgtraffic.tlog\unsuccessfulbuild".
Touching "fgtraffic.dir\RelWithDebInfo\fgtraffic.tlog\fgtraffic.lastbuildstate".
Done Building Project "G:\Jenkins\workspace\FlightGear-Win\build32\utils\traffic\fgtraffic.vcxproj" (default targets).
The target "BeforeGenerateProjectPriFile" listed in a BeforeTargets attribute at "C:\Program Files (x86)\MSBuild\Microsoft\NuGet\Microsoft.NuGet.targets (186,61)" does not exist in the project, and will be ignored.
Project "G:\Jenkins\workspace\FlightGear-Win\build32\ALL_BUILD.vcxproj" (2) is building "G:\Jenkins\workspace\FlightGear-Win\build32\utils\fgviewer\fgviewer.vcxproj" (20) on node 1 (default targets).
InitializeBuildStatus:
Creating "fgviewer.dir\RelWithDebInfo\fgviewer.tlog\unsuccessfulbuild" because "AlwaysCreate" was specified.
CustomBuild:
All outputs are up-to-date.
ClCompile:
All outputs are up-to-date.
Link:
All outputs are up-to-date.
fgviewer.vcxproj -> G:\Jenkins\workspace\FlightGear-Win\build32\utils\fgviewer\RelWithDebInfo\fgviewer.exe
FinalizeBuildStatus:
Deleting file "fgviewer.dir\RelWithDebInfo\fgviewer.tlog\unsuccessfulbuild".
Touching "fgviewer.dir\RelWithDebInfo\fgviewer.tlog\fgviewer.lastbuildstate".
Done Building Project "G:\Jenkins\workspace\FlightGear-Win\build32\utils\fgviewer\fgviewer.vcxproj" (default targets).
The target "BeforeGenerateProjectPriFile" listed in a BeforeTargets attribute at "C:\Program Files (x86)\MSBuild\Microsoft\NuGet\Microsoft.NuGet.targets (186,61)" does not exist in the project, and will be ignored.
Project "G:\Jenkins\workspace\FlightGear-Win\build32\ALL_BUILD.vcxproj" (2) is building "G:\Jenkins\workspace\FlightGear-Win\build32\src\Input\js_demo.vcxproj" (21) on node 1 (default targets).
InitializeBuildStatus:
Creating "js_demo.dir\RelWithDebInfo\js_demo.tlog\unsuccessfulbuild" because "AlwaysCreate" was specified.
CustomBuild:
All outputs are up-to-date.
ClCompile:
All outputs are up-to-date.
Link:
All outputs are up-to-date.
js_demo.vcxproj -> G:\Jenkins\workspace\FlightGear-Win\build32\src\Input\RelWithDebInfo\js_demo.exe
FinalizeBuildStatus:
Deleting file "js_demo.dir\RelWithDebInfo\js_demo.tlog\unsuccessfulbuild".
Touching "js_demo.dir\RelWithDebInfo\js_demo.tlog\js_demo.lastbuildstate".
Done Building Project "G:\Jenkins\workspace\FlightGear-Win\build32\src\Input\js_demo.vcxproj" (default targets).
The target "BeforeGenerateProjectPriFile" listed in a BeforeTargets attribute at "C:\Program Files (x86)\MSBuild\Microsoft\NuGet\Microsoft.NuGet.targets (186,61)" does not exist in the project, and will be ignored.
Project "G:\Jenkins\workspace\FlightGear-Win\build32\ALL_BUILD.vcxproj" (2) is building "G:\Jenkins\workspace\FlightGear-Win\build32\src\Main\metar.vcxproj" (22) on node 1 (default targets).
InitializeBuildStatus:
Creating "metar.dir\RelWithDebInfo\metar.tlog\unsuccessfulbuild" because "AlwaysCreate" was specified.
CustomBuild:
All outputs are up-to-date.
ClCompile:
All outputs are up-to-date.
Link:
All outputs are up-to-date.
metar.vcxproj -> G:\Jenkins\workspace\FlightGear-Win\build32\src\Main\RelWithDebInfo\metar.exe
FinalizeBuildStatus:
Deleting file "metar.dir\RelWithDebInfo\metar.tlog\unsuccessfulbuild".
Touching "metar.dir\RelWithDebInfo\metar.tlog\metar.lastbuildstate".
Done Building Project "G:\Jenkins\workspace\FlightGear-Win\build32\src\Main\metar.vcxproj" (default targets).
The target "BeforeGenerateProjectPriFile" listed in a BeforeTargets attribute at "C:\Program Files (x86)\MSBuild\Microsoft\NuGet\Microsoft.NuGet.targets (186,61)" does not exist in the project, and will be ignored.
Project "G:\Jenkins\workspace\FlightGear-Win\build32\ALL_BUILD.vcxproj" (2) is building "G:\Jenkins\workspace\FlightGear-Win\build32\src\FDM\YASim\yasim.vcxproj" (23) on node 1 (default targets).
InitializeBuildStatus:
Creating "yasim.dir\RelWithDebInfo\yasim.tlog\unsuccessfulbuild" because "AlwaysCreate" was specified.
CustomBuild:
All outputs are up-to-date.
ClCompile:
All outputs are up-to-date.
Link:
All outputs are up-to-date.
yasim.vcxproj -> G:\Jenkins\workspace\FlightGear-Win\build32\src\FDM\YASim\RelWithDebInfo\yasim.exe
FinalizeBuildStatus:
Deleting file "yasim.dir\RelWithDebInfo\yasim.tlog\unsuccessfulbuild".
Touching "yasim.dir\RelWithDebInfo\yasim.tlog\yasim.lastbuildstate".
Done Building Project "G:\Jenkins\workspace\FlightGear-Win\build32\src\FDM\YASim\yasim.vcxproj" (default targets).
The target "BeforeGenerateProjectPriFile" listed in a BeforeTargets attribute at "C:\Program Files (x86)\MSBuild\Microsoft\NuGet\Microsoft.NuGet.targets (186,61)" does not exist in the project, and will be ignored.
Project "G:\Jenkins\workspace\FlightGear-Win\build32\ALL_BUILD.vcxproj" (2) is building "G:\Jenkins\workspace\FlightGear-Win\build32\src\FDM\YASim\yasim-atmotest.vcxproj" (24) on node 1 (default targets).
InitializeBuildStatus:
Creating "yasim-atmotest.dir\RelWithDebInfo\yasim-atmotest.tlog\unsuccessfulbuild" because "AlwaysCreate" was specified.
CustomBuild:
All outputs are up-to-date.
ClCompile:
All outputs are up-to-date.
Link:
All outputs are up-to-date.
yasim-atmotest.vcxproj -> G:\Jenkins\workspace\FlightGear-Win\build32\src\FDM\YASim\RelWithDebInfo\yasim-atmotest.exe
FinalizeBuildStatus:
Deleting file "yasim-atmotest.dir\RelWithDebInfo\yasim-atmotest.tlog\unsuccessfulbuild".
Touching "yasim-atmotest.dir\RelWithDebInfo\yasim-atmotest.tlog\yasim-atmotest.lastbuildstate".
Done Building Project "G:\Jenkins\workspace\FlightGear-Win\build32\src\FDM\YASim\yasim-atmotest.vcxproj" (default targets).
The target "BeforeGenerateProjectPriFile" listed in a BeforeTargets attribute at "C:\Program Files (x86)\MSBuild\Microsoft\NuGet\Microsoft.NuGet.targets (186,61)" does not exist in the project, and will be ignored.
Project "G:\Jenkins\workspace\FlightGear-Win\build32\ALL_BUILD.vcxproj" (2) is building "G:\Jenkins\workspace\FlightGear-Win\build32\src\FDM\YASim\yasim-proptest.vcxproj" (25) on node 1 (default targets).
InitializeBuildStatus:
Creating "yasim-proptest.dir\RelWithDebInfo\yasim-proptest.tlog\unsuccessfulbuild" because "AlwaysCreate" was specified.
CustomBuild:
All outputs are up-to-date.
ClCompile:
All outputs are up-to-date.
Link:
All outputs are up-to-date.
yasim-proptest.vcxproj -> G:\Jenkins\workspace\FlightGear-Win\build32\src\FDM\YASim\RelWithDebInfo\yasim-proptest.exe
FinalizeBuildStatus:
Deleting file "yasim-proptest.dir\RelWithDebInfo\yasim-proptest.tlog\unsuccessfulbuild".
Touching "yasim-proptest.dir\RelWithDebInfo\yasim-proptest.tlog\yasim-proptest.lastbuildstate".
Done Building Project "G:\Jenkins\workspace\FlightGear-Win\build32\src\FDM\YASim\yasim-proptest.vcxproj" (default targets).
Done Building Project "G:\Jenkins\workspace\FlightGear-Win\build32\ALL_BUILD.vcxproj" (default targets) -- FAILED.
Done Building Project "G:\Jenkins\workspace\FlightGear-Win\build32\INSTALL.vcxproj" (default targets) -- FAILED.

Build FAILED.

"G:\Jenkins\workspace\FlightGear-Win\build32\INSTALL.vcxproj" (default target) (1) ->
"G:\Jenkins\workspace\FlightGear-Win\build32\ALL_BUILD.vcxproj" (default target) (2) ->
"G:\Jenkins\workspace\FlightGear-Win\build32\src\Main\fgfs.vcxproj" (default target) (12) ->
"G:\Jenkins\workspace\FlightGear-Win\build32\src\GUI\fglauncher.vcxproj" (default target) (13) ->
(ClCompile target) ->
G:\Jenkins\workspace\FlightGear-Win\install\msvc140\SimGear\include\simgear/structure/SGSharedPtr.hxx(90): warning C4150: deletion of pointer to incomplete type 'simgear::pkg::Install'; no destructor called (compiling source file G:\Jenkins\workspace\FlightGear-Win\source\src\GUI\AircraftItemDelegate.cxx) [G:\Jenkins\workspace\FlightGear-Win\build32\src\GUI\fglauncher.vcxproj]
G:\Jenkins\workspace\FlightGear-Win\install\msvc140\SimGear\include\simgear/structure/SGSharedPtr.hxx(90): warning C4150: deletion of pointer to incomplete type 'simgear::pkg::Install'; no destructor called (compiling source file G:\Jenkins\workspace\FlightGear-Win\source\src\GUI\CatalogListModel.cxx) [G:\Jenkins\workspace\FlightGear-Win\build32\src\GUI\fglauncher.vcxproj]
G:\Jenkins\workspace\FlightGear-Win\install\msvc140\SimGear\include\simgear/structure/SGSharedPtr.hxx(90): warning C4150: deletion of pointer to incomplete type 'simgear::pkg::Install'; no destructor called (compiling source file G:\Jenkins\workspace\FlightGear-Win\source\src\GUI\AddCatalogDialog.cxx) [G:\Jenkins\workspace\FlightGear-Win\build32\src\GUI\fglauncher.vcxproj]
G:\Jenkins\workspace\FlightGear-Win\install\msvc140\SimGear\include\simgear/structure/SGSharedPtr.hxx(90): warning C4150: deletion of pointer to incomplete type 'simgear::pkg::Install'; no destructor called (compiling source file G:\Jenkins\workspace\FlightGear-Win\source\src\GUI\PathsDialog.cxx) [G:\Jenkins\workspace\FlightGear-Win\build32\src\GUI\fglauncher.vcxproj]
G:\Jenkins\workspace\FlightGear-Win\install\msvc140\SimGear\include\simgear/structure/SGSharedPtr.hxx(90): warning C4150: deletion of pointer to incomplete type 'simgear::pkg::Install'; no destructor called (compiling source file G:\Jenkins\workspace\FlightGear-Win\source\src\GUI\AircraftSearchFilterModel.cxx) [G:\Jenkins\workspace\FlightGear-Win\build32\src\GUI\fglauncher.vcxproj]
G:\Jenkins\workspace\FlightGear-Win\install\msvc140\SimGear\include\simgear/structure/SGSharedPtr.hxx(90): warning C4150: deletion of pointer to incomplete type 'simgear::pkg::Install'; no destructor called (compiling source file G:\Jenkins\workspace\FlightGear-Win\build32\src\GUI\fglauncher_automoc.cpp) [G:\Jenkins\workspace\FlightGear-Win\build32\src\GUI\fglauncher.vcxproj]


"G:\Jenkins\workspace\FlightGear-Win\build32\INSTALL.vcxproj" (default target) (1) ->
"G:\Jenkins\workspace\FlightGear-Win\build32\ALL_BUILD.vcxproj" (default target) (2) ->
"G:\Jenkins\workspace\FlightGear-Win\build32\src\Main\fgfs.vcxproj" (default target) (12) ->
"G:\Jenkins\workspace\FlightGear-Win\build32\src\GUI\fglauncher.vcxproj" (default target) (13) ->
(ClCompile target) ->
G:\Jenkins\workspace\FlightGear-Win\install\msvc140\SimGear\include\simgear/structure/SGSharedPtr.hxx(90): error C2027: use of undefined type 'simgear::pkg::Install' (compiling source file G:\Jenkins\workspace\FlightGear-Win\source\src\GUI\AircraftItemDelegate.cxx) [G:\Jenkins\workspace\FlightGear-Win\build32\src\GUI\fglauncher.vcxproj]
G:\Jenkins\workspace\FlightGear-Win\install\msvc140\SimGear\include\simgear/structure/SGSharedPtr.hxx(90): error C3861: 'put': identifier not found (compiling source file G:\Jenkins\workspace\FlightGear-Win\source\src\GUI\AircraftItemDelegate.cxx) [G:\Jenkins\workspace\FlightGear-Win\build32\src\GUI\fglauncher.vcxproj]
G:\Jenkins\workspace\FlightGear-Win\install\msvc140\SimGear\include\simgear/structure/SGSharedPtr.hxx(90): error C2027: use of undefined type 'simgear::pkg::Install' (compiling source file G:\Jenkins\workspace\FlightGear-Win\source\src\GUI\CatalogListModel.cxx) [G:\Jenkins\workspace\FlightGear-Win\build32\src\GUI\fglauncher.vcxproj]
G:\Jenkins\workspace\FlightGear-Win\install\msvc140\SimGear\include\simgear/structure/SGSharedPtr.hxx(90): error C3861: 'put': identifier not found (compiling source file G:\Jenkins\workspace\FlightGear-Win\source\src\GUI\CatalogListModel.cxx) [G:\Jenkins\workspace\FlightGear-Win\build32\src\GUI\fglauncher.vcxproj]
G:\Jenkins\workspace\FlightGear-Win\install\msvc140\SimGear\include\simgear/structure/SGSharedPtr.hxx(90): error C2027: use of undefined type 'simgear::pkg::Install' (compiling source file G:\Jenkins\workspace\FlightGear-Win\source\src\GUI\AddCatalogDialog.cxx) [G:\Jenkins\workspace\FlightGear-Win\build32\src\GUI\fglauncher.vcxproj]
G:\Jenkins\workspace\FlightGear-Win\install\msvc140\SimGear\include\simgear/structure/SGSharedPtr.hxx(90): error C3861: 'put': identifier not found (compiling source file G:\Jenkins\workspace\FlightGear-Win\source\src\GUI\AddCatalogDialog.cxx) [G:\Jenkins\workspace\FlightGear-Win\build32\src\GUI\fglauncher.vcxproj]
G:\Jenkins\workspace\FlightGear-Win\install\msvc140\SimGear\include\simgear/structure/SGSharedPtr.hxx(90): error C2027: use of undefined type 'simgear::pkg::Install' (compiling source file G:\Jenkins\workspace\FlightGear-Win\source\src\GUI\PathsDialog.cxx) [G:\Jenkins\workspace\FlightGear-Win\build32\src\GUI\fglauncher.vcxproj]
G:\Jenkins\workspace\FlightGear-Win\install\msvc140\SimGear\include\simgear/structure/SGSharedPtr.hxx(90): error C3861: 'put': identifier not found (compiling source file G:\Jenkins\workspace\FlightGear-Win\source\src\GUI\PathsDialog.cxx) [G:\Jenkins\workspace\FlightGear-Win\build32\src\GUI\fglauncher.vcxproj]
G:\Jenkins\workspace\FlightGear-Win\install\msvc140\SimGear\include\simgear/structure/SGSharedPtr.hxx(90): error C2027: use of undefined type 'simgear::pkg::Install' (compiling source file G:\Jenkins\workspace\FlightGear-Win\source\src\GUI\AircraftSearchFilterModel.cxx) [G:\Jenkins\workspace\FlightGear-Win\build32\src\GUI\fglauncher.vcxproj]
G:\Jenkins\workspace\FlightGear-Win\install\msvc140\SimGear\include\simgear/structure/SGSharedPtr.hxx(90): error C3861: 'put': identifier not found (compiling source file G:\Jenkins\workspace\FlightGear-Win\source\src\GUI\AircraftSearchFilterModel.cxx) [G:\Jenkins\workspace\FlightGear-Win\build32\src\GUI\fglauncher.vcxproj]
G:\Jenkins\workspace\FlightGear-Win\install\msvc140\SimGear\include\simgear/structure/SGSharedPtr.hxx(90): error C2027: use of undefined type 'simgear::pkg::Install' (compiling source file G:\Jenkins\workspace\FlightGear-Win\build32\src\GUI\fglauncher_automoc.cpp) [G:\Jenkins\workspace\FlightGear-Win\build32\src\GUI\fglauncher.vcxproj]
G:\Jenkins\workspace\FlightGear-Win\install\msvc140\SimGear\include\simgear/structure/SGSharedPtr.hxx(90): error C3861: 'put': identifier not found (compiling source file G:\Jenkins\workspace\FlightGear-Win\build32\src\GUI\fglauncher_automoc.cpp) [G:\Jenkins\workspace\FlightGear-Win\build32\src\GUI\fglauncher.vcxproj]

6 Warning(s)
12 Error(s)

Time Elapsed 00:00:31.38

G:\Jenkins\workspace\FlightGear-Win\build32>exit 1
Build step 'Execute Windows batch command' marked build as failure
Archiving artifacts
IRC notifier plugin: Sending notification to: #builds

------------------------------------------------------------------------------
Check out the vibrant tech community on one of the world's most
engaging tech sites, Slashdot.org! http://sdm.link/slashdot
_______________________________________________
Flightgear-builds mailing list
Flightgear-***@lists.sourceforge.net<mailto:Flightgear-***@lists.sourceforge.net>
https://lists.sourceforge.net/lists/listinfo/flightgear-builds
--

Torsten Dreyer
James Turner
2017-07-18 15:53:25 UTC
Permalink
> On 18 Jul 2017, at 16:17, Ron H <***@hotmail.com> wrote:
>
> I had this issue on my personal build - I noted this in a message Jul 7th 2017.
>
> https://sourceforge.net/p/flightgear/mailman/message/35933348/ <https://sourceforge.net/p/flightgear/mailman/message/35933348/>
>
> Adding includes in a few files fixed it for me.
>

Yep, I saw your message about that, will attempt to make the corresponding fixes in the main code.

Thanks,
James
James Turner
2017-07-19 13:12:22 UTC
Permalink
> On 18 Jul 2017, at 15:17, Torsten Dreyer <***@t3r.de> wrote:
>
> the windows build of fg has been flagged red for a month or so.
> I thought this might have been due to some stale files of the preceeding SimGear build but wiping the workspace of both projects (sg + fg) did not help.
>
> If anybody has an idea what might cause this, please...
>
> We need a green Jenkins for the release in just a few weeks.

I’ve pushed fixes for the issue Ron reported, unfortunately we have another issue with the embedded-resources. For some reason the Cmake step which runs the resource-generator fails on the Jenkins build slave, despite working for me locally, and presumably also for Ron, since he did not mention this issue.

Other Windows users, I guess this also works for you? Alan Teeder for example?

I queried the issue on the Cmake list, the error code translates to:

"When you convert that error code to hex, it's 0xc0000139, and if you
google that, you see it's an "entry point not found" error code.”

Which suggests we are still fighting some kind of 32-bit vs 64-bit issue, but I haven’t been able to spot what so far. I only ever try to build 64-bit on Windows myself, maybe it’s a 32-bit issue?

I will ping Gene about what access I can get to the slave, to try running things interactively.

Kind regards,
James
James Turner
2017-07-19 14:21:05 UTC
Permalink
> On 19 Jul 2017, at 14:12, James Turner <***@kdab.com> wrote:
>
> Which suggests we are still fighting some kind of 32-bit vs 64-bit issue, but I haven’t been able to spot what so far. I only ever try to build 64-bit on Windows myself, maybe it’s a 32-bit issue?
>
> I will ping Gene about what access I can get to the slave, to try running things interactively.

On a hunch, I swapped the order of the 32-bit and 64-bit builds, and the 64-bit build seems to work ok.

This makes me think the issue is probably a stray zlib.dll in the PATH, which is 64-bit and hence throwing off the lookup of the 32-bit one in 3rdparty/msvc140

I will poke around with controlling the PATH visible when CMake runs fgrcc, but any hints from Windows folks would be welcome.

Did I mention I hate Windows?

Kind regards,
James
Florent Rougon
2017-07-19 14:29:27 UTC
Permalink
James Turner <***@kdab.com> wrote:

> I’ve pushed fixes for the issue Ron reported, unfortunately we have another
> issue with the embedded-resources. For some reason the Cmake step which runs
> the resource-generator fails on the Jenkins build slave, despite working for
> me locally, and presumably also for Ron, since he did not mention this issue.
> Other Windows users, I guess this also works for you? Alan Teeder for example?

Geoff reported success, too.

> I queried the issue on the Cmake list, the error code translates to:
>
> "When you convert that error code to hex, it's 0xc0000139, and if you
> google that, you see it's an "entry point not found" error code.”
>
> Which suggests we are still fighting some kind of 32-bit vs 64-bit issue, but
> I haven’t been able to spot what so far. I only ever try to build 64-bit on
> Windows myself, maybe it’s a 32-bit issue?

Indeed, if you look at:

http://build.flightgear.org:8080/job/FlightGear-Win/lastFailedBuild/consoleFull

the first build succeeds. The 64 bits build seems to work, but not the
32 bits one, if I read things correctly. But I don't know why. :-/

Thanks for looking into it!

Regards

--
Florent
w***@gmail.com
2017-07-19 17:06:00 UTC
Permalink
On 07/19/2017 09:12 AM, James Turner wrote:
> Which suggests we are still fighting some kind of 32-bit vs 64-bit issue, but
> I haven’t been able to spot what so far. I only ever try to build 64-bit on
> Windows myself, maybe it’s a 32-bit issue?

if i may ask, has there been any thought to just dropping 32bit builds? what
winwhatever used today is still 32bit only?? i hate phone home apps but is there
something (other than download counters which are easily manipulated) that shows
how widely used the 32bit only builds are?


/me looks around real quick to see if any of his 16bit DOS BBS world friends are
watching...


--
NOTE: No off-list assistance is given without prior approval.
*Please keep mailing list traffic on the list unless*
*a signed and pre-paid contract is in effect with us.*
James Turner
2017-07-19 17:13:16 UTC
Permalink
> On 19 Jul 2017, at 18:06, ***@gmail.com wrote:
>
> if i may ask, has there been any thought to just dropping 32bit builds? what winwhatever used today is still 32bit only?? i hate phone home apps but is there something (other than download counters which are easily manipulated) that shows how widely used the 32bit only builds are?

I’ve raised that possibility several times in the past few years, and each time been told that 32-bit builds are still important. Dropping them would simplify a bunch of things in the build / release / install process.

Kind regards,
James
Ron H
2017-07-19 19:00:54 UTC
Permalink
My 2 cents - perhaps set a end-of-life date/version to give people a chance to upgrade to 64-bits - say 2017.3.0 - lol


Ron


Windows 10, VS2015


________________________________
From: James Turner <***@kdab.com>
Sent: July 19, 2017 1:13 PM
To: FlightGear developers discussions
Subject: Re: [Flightgear-devel] [Flightgear-builds] Build failed in Jenkins: FlightGear-Win #2880


On 19 Jul 2017, at 18:06, ***@gmail.com<mailto:***@gmail.com> wrote:

if i may ask, has there been any thought to just dropping 32bit builds? what winwhatever used today is still 32bit only?? i hate phone home apps but is there something (other than download counters which are easily manipulated) that shows how widely used the 32bit only builds are?

I’ve raised that possibility several times in the past few years, and each time been told that 32-bit builds are still important. Dropping them would simplify a bunch of things in the build / release / install process.

Kind regards,
James
geneb
2017-07-19 19:56:22 UTC
Permalink
On Wed, 19 Jul 2017, Ron H wrote:

> My 2 cents - perhaps set a end-of-life date/version to give people a
> chance to upgrade to 64-bits - say 2017.3.0 - lol

The last 32 bit x86 CPU was released in 2007 (I don't count the Atom) and
even then it was a low-power chip for use in embedded systems.

I think a 10 year grace period is insanely gracious and it's time to drop
the 32 bit builds entirely.

g.
--
Proud owner of F-15C 80-0007
http://www.f15sim.com - The only one of its kind.
http://www.diy-cockpits.org/coll - Go Collimated or Go Home.
Some people collect things for a hobby. Geeks collect hobbies.

ScarletDME - The red hot Data Management Environment
A Multi-Value database for the masses, not the classes.
http://scarlet.deltasoft.com - Get it _today_!
James Turner
2017-07-19 21:14:25 UTC
Permalink
> On 19 Jul 2017, at 20:56, geneb <***@deltasoft.com> wrote:
>
>> My 2 cents - perhaps set a end-of-life date/version to give people a chance to upgrade to 64-bits - say 2017.3.0 - lol
>
> The last 32 bit x86 CPU was released in 2007 (I don't count the Atom) and even then it was a low-power chip for use in embedded systems.
>
> I think a 10 year grace period is insanely gracious and it's time to drop the 32 bit builds entirely.

Yeah, I think declaring a certain version as the last 32-bit release for Windows makes sense, but I don’t think we should do it retro-actively, so we still need to figure out the current issue :)

Kind regards,
James
Loading...